{"text_format":"1","workbook":"xlsx","n_sheets":11,"sheets":["Instructions","Exhibit Checklist","Application","Dev Team Info","Development Schedule","Rental Income Calc Worksheet","DEVBGT","Cash Flow","Sources of Funds","Sworn Cert","Fin Asst Wksht"],"not_rendered":{"charts":0,"images":7,"macros":1,"external_links":0,"defined_names":12,"comments":7,"pivot_tables":0},"unopened":[],"bounds":{"document_bytes":16777216,"sheet_cells":100000,"rows_first":2000,"rows_last":500,"rows_between":2000,"halvings":0,"cell_chars":16384,"cell_head_chars":4096},"cells_cut":0,"cells_raw":0,"read":"whole","date_system":"1900"}

{"sheet":"Instructions","index":0,"n_rows":37,"n_cols":2,"rows_kept":37,"cut":false,"hidden":false,"merged":[[1,0,1,2],[29,0,30,0]]}
[]
["WORKBOOK INSTRUCTIONS"]
[]
[]
["Security/Macros:","The Funding Statement of Readiness application contains numerous Excel macros, meaning that various worksheets share information.  To allow the macros to work properly, the security setting on your Microsoft Excel program must be turned to LOW.  For Windows XP and lower, this is done through TOOLS->MACRO->SECURITY.  See screenshot below.  After setting security to LOW, close out of excel and re-open the document.  For Windows VISTA, click the Microsoft Office Button          and then click Excel Options. In the Trust Center category, click Trust Center Settings, and then click the Macro Settings category and set the security to low.  For Windows 7, choose File, Options, Trust Center and click on Trust Center Settings.  Set the macro security to low.\n"]
[]
[]
[]
[]
[]
[]
[]
[]
[]
[]
[]
[]
[]
[]
[]
{"$rows_left_out":18}
{"sheet":"Exhibit Checklist","index":1,"n_rows":43,"n_cols":20,"rows_kept":43,"cut":false,"hidden":false,"merged":[[16,10,16,11],[42,10,42,11],[40,10,40,11],[41,10,41,11],[18,10,18,11],[20,10,20,11],[24,10,24,11],[38,10,38,11],[39,10,39,11],[17,2,17,3],[13,2,13,3],[3,0,3,19],[12,0,12,3],[7,14,7,15],[11,12,11,18],[7,6,7,13],[7,16,7,19],[5,0,5,19],[17,0,17,1],[13,0,13,1],[17,4,17,5],[13,4,13,5],[11,19,12,19],[14,10,14,11],[15,10,15,11],[1,5,1,14],[11,0,11,11],[12,4,12,11],[13,13,13,18],[13,8,13,9],[13,10,13,11],[13,6,13,7],[2,17,2,19],[37,4,37,5],[37,6,37,7],[37,8,37,9],[37,10,37,11],[23,4,23,5],[23,6,23,7],[23,8,23,9],[23,10,23,11],[19,4,19,5],[19,6,19,7],[19,8,19,9],[19,10,19,11],[17,8,17,9],[17,6,17,7],[17,10,17,11]]}
[]
[null,null,null,null,"SUBMISSION DATE"]
[null,null,null,null,null,null,null,null,null,null,null,null,null,null,null,null,null,"Version 2.0: 11/2013\n"]
["EXHIBIT CHECKLIST"]
[]
[]
[]
[null,null,null,null,null,"DEVELOPMENT NAME",{"$f":"Application!D50","v":0},null,null,null,null,null,null,null,"APPLICANT",null,{"$f":"Application!D10","v":0}]
[]
[]
[]
["\"X\" if submitted ",null,null,null,null,null,null,null,null,null,null,null,"THIS FORM MUST BE SUBMITTED WITH APPLICATION",null,null,null,null,null,null,"CHFA/ DOH use only"]
[]
[null,null,null,null,null,null,null,null,null,null,null,null,"Exhibit Number"]
[null,null,null,null,null,null,null,null,null,null,null,null,"A","Completed Exhibit Checklist (Form Provided)"]
[null,null,null,null,null,null,null,null,null,null,null,null,"B","Application (Form Provided)"]
[null,null,null,null,null,null,null,null,null,null,null,null,"C","Signature Page"]
[null,null,null,null,null,null,null,null,null,null,null,null,null,"SECTION I. APPLICANT "]
[null,null,null,null,null,null,null,null,null,null,null,null,null,"No Exhibits"]
[null,null,null,null,null,null,null,null,null,null,null,null,null,"SECTION II. DEVELOPMENT TEAM & READINESS"]
{"$rows_left_out":24}
{"sheet":"Application","index":2,"n_rows":254,"n_cols":15,"rows_kept":254,"cut":false,"hidden":false,"merged":[[109,2,109,9],[206,2,206,8],[207,2,207,8],[242,2,242,8],[35,2,35,4],[203,2,203,7],[204,2,204,8],[201,2,201,8],[209,2,209,8],[190,4,191,4],[190,5,191,5],[194,4,194,5],[195,4,195,5],[68,4,68,7],[51,3,51,5],[140,7,140,8],[93,2,93,3],[94,2,94,8],[174,2,174,9],[175,2,175,9],[60,5,60,6],[227,2,227,8],[79,6,79,7],[100,7,100,8],[176,2,176,9],[63,2,63,3],[118,0,118,9],[121,2,121,5],[1,0,1,9],[4,0,4,9],[9,3,9,5],[11,3,11,5],[2,0,2,9],[13,3,13,5],[17,3,17,4],[17,7,17,9],[15,7,15,9],[19,7,19,9],[28,3,28,4],[15,3,15,5],[31,0,31,9],[19,3,19,4],[21,3,21,4],[21,7,21,9],[120,2,120,7],[78,6,78,7],[112,7,112,8],[36,2,36,9],[39,2,39,9],[41,2,41,9],[40,6,40,7],[62,2,62,3],[80,6,80,7],[165,0,165,9],[74,2,74,3],[198,2,198,8],[61,5,61,6],[64,5,64,6],[61,7,61,8],[64,7,64,8],[60,7,60,8],[73,2,73,3],[171,2,171,9],[66,2,66,9],[67,2,67,9],[179,2,179,9],[168,2,168,9],[64,2,64,3],[178,2,178,3],[140,2,140,4],[140,5,140,6],[211,0,211,9],[69,2,69,3],[231,2,231,8],[237,2,237,8],[238,2,238,8],[0,3,0,6],[72,2,72,9],[78,2,78,5],[80,2,80,5],[81,2,81,5],[82,2,82,5],[83,2,83,5],[45,0,45,9],[49,3,49,9],[87,2,87,9],[70,2,70,3],[213,2,213,8],[51,7,51,9],[53,3,53,5],[56,2,56,9],[57,2,57,9],[61,2,61,3],[63,5,63,6],[63,7,63,8],[215,2,215,8],[240,0,240,9],[248,1,248,9],[249,1,249,9],[245,1,245,5],[245,6,245,9],[241,2,241,8],[243,2,243,8],[247,1,247,9],[226,2,226,8],[224,2,224,8],[230,2,230,8],[216,2,216,8],[217,2,217,8],[218,2,218,8],[219,3,219,8],[220,3,220,8],[222,0,222,9],[229,2,229,8],[228,2,228,8],[236,2,236,8],[100,2,100,5],[101,2,101,7],[104,2,104,7],[83,6,83,7],[81,6,81,7],[82,6,82,7],[144,2,144,4],[144,5,144,6],[144,7,144,8],[135,2,135,3],[122,2,122,5],[123,2,123,5],[124,2,124,5],[125,2,125,5],[127,2,127,5],[128,2,128,5],[121,6,121,7],[122,6,122,7],[123,6,123,7],[124,6,124,7],[125,6,125,7],[126,6,126,7],[127,6,127,7],[158,2,158,4],[158,5,158,6],[158,7,158,8],[150,2,150,4],[150,5,150,6],[150,7,150,8],[151,2,151,4],[151,5,151,6],[151,7,151,8],[152,2,152,4],[152,5,152,6],[152,7,152,8],[136,2,136,8],[146,2,146,4],[154,2,154,4],[156,2,156,4],[156,5,156,6],[156,7,156,8],[157,2,157,4],[157,5,157,6],[157,7,157,8],[148,2,148,4],[148,5,148,6],[148,7,148,8],[149,2,149,4],[149,5,149,6],[149,7,149,8],[141,2,141,4],[141,5,141,6],[141,7,141,8],[142,2,142,4],[142,5,142,6],[142,7,142,8],[143,2,143,4],[143,5,143,6],[143,7,143,8],[79,2,79,5],[91,2,91,7],[173,2,173,8],[235,2,235,8],[232,2,232,8],[233,2,233,8],[234,2,234,8],[106,2,106,3],[107,2,107,3],[84,2,84,7],[111,2,111,7],[113,2,113,8],[116,2,116,7],[132,2,132,7],[133,2,133,8],[90,2,90,7],[97,2,97,8],[159,2,159,4],[159,5,159,6],[159,7,159,8],[160,2,160,4],[160,5,160,6],[160,7,160,8]]}
[null,null,null,"State-Sponsored Housing Portfolio"]
[" Application for ",null,null,null,null,null,null,null,null,null,null,"Version 1.0: 08/2013"]
[" Rental Development and Rehabilitation Projects"]
[]
["SECTION I.  APPLICANT "]
[]
["Applicant Information"]
[null,1.1000000000000001,"Applicant (Owner/Mortgagor)"]
[]
[null,null,"Applicant Name"]
[]
[null,null,"Applicant Address"]
[]
[null,null,"City",null,null,null,"State",null,"Zip"]
[]
[null,null,"Contact Name",null,null,null,"Title"]
[]
[null,null,"Phone",null,null,null,"Fax"]
[]
[null,null,"Email",null,null,null,"FEIN"]
{"$rows_left_out":235}
{"sheet":"Dev Team Info","index":3,"n_rows":163,"n_cols":13,"rows_kept":163,"cut":false,"hidden":false,"merged":[[126,0,126,2],[126,3,126,4],[126,5,126,7],[126,8,126,9],[123,0,123,2],[123,3,123,4],[123,5,123,7],[123,8,123,9],[124,0,124,2],[124,3,124,4],[124,5,124,7],[124,8,124,9],[125,0,125,2],[125,3,125,4],[125,5,125,7],[125,8,125,9],[120,5,120,7],[120,8,120,9],[121,0,121,2],[121,3,121,4],[121,5,121,7],[121,8,121,9],[122,0,122,2],[122,3,122,4],[122,5,122,7],[122,8,122,9],[105,0,105,2],[105,3,105,4],[105,5,105,7],[105,8,105,9],[106,0,106,2],[106,3,106,4],[106,5,106,7],[106,8,106,9],[117,0,117,9],[109,2,109,9],[102,0,102,2],[102,3,102,4],[102,5,102,7],[102,8,102,9],[103,0,103,2],[103,3,103,4],[103,5,103,7],[103,8,103,9],[104,0,104,2],[104,3,104,4],[104,5,104,7],[104,8,104,9],[99,0,99,2],[99,3,99,4],[99,5,99,7],[99,8,99,9],[100,0,100,2],[100,3,100,4],[100,5,100,7],[100,8,100,9],[101,0,101,2],[101,3,101,4],[101,5,101,7],[101,8,101,9],[77,0,77,9],[97,0,97,9],[98,0,98,2],[98,3,98,4],[98,5,98,7],[98,8,98,9],[84,0,84,2],[84,3,84,4],[84,5,84,7],[84,8,84,9],[85,0,85,2],[85,3,85,4],[85,5,85,7],[85,8,85,9],[86,0,86,2],[86,3,86,4],[86,5,86,7],[86,8,86,9],[81,0,81,2],[81,3,81,4],[81,5,81,7],[81,8,81,9],[82,0,82,2],[82,3,82,4],[82,5,82,7],[82,8,82,9],[83,0,83,2],[83,3,83,4],[83,5,83,7],[83,8,83,9],[78,0,78,2],[78,3,78,4],[78,5,78,7],[78,8,78,9],[79,0,79,2],[79,3,79,4],[79,5,79,7],[79,8,79,9],[80,0,80,2],[80,3,80,4],[80,5,80,7],[80,8,80,9],[61,0,61,2],[61,3,61,4],[61,5,61,7],[61,8,61,9],[62,0,62,2],[62,3,62,4],[62,5,62,7],[62,8,62,9],[58,5,58,7],[58,8,58,9],[59,0,59,2],[59,3,59,4],[59,5,59,7],[59,8,59,9],[60,0,60,2],[60,3,60,4],[60,5,60,7],[60,8,60,9],[33,0,33,9],[53,0,53,9],[54,0,54,2],[54,3,54,4],[54,5,54,7],[54,8,54,9],[55,0,55,2],[55,3,55,4],[55,5,55,7],[55,8,55,9],[40,0,40,2],[40,3,40,4],[40,5,40,7],[40,8,40,9],[41,0,41,2],[41,3,41,4],[41,5,41,7],[41,8,41,9],[42,0,42,2],[42,3,42,4],[42,5,42,7],[42,8,42,9],[37,0,37,2],[37,3,37,4],[37,5,37,7],[37,8,37,9],[38,0,38,2],[38,3,38,4],[38,5,38,7],[38,8,38,9],[39,0,39,2],[39,3,39,4],[39,5,39,7],[39,8,39,9],[34,0,34,2],[34,3,34,4],[34,5,34,7],[34,8,34,9],[35,0,35,2],[35,3,35,4],[35,5,35,7],[35,8,35,9],[36,0,36,2],[36,3,36,4],[36,5,36,7],[36,8,36,9],[95,5,95,7],[65,2,65,9],[66,2,66,5],[66,7,66,9],[92,2,92,5],[92,7,92,9],[1,0,1,9],[4,2,4,4],[4,7,4,9],[49,2,49,5],[49,7,49,9],[22,5,22,7],[22,8,22,9],[31,8,31,9],[31,5,31,7],[27,2,27,9],[73,2,73,4],[72,2,72,9],[44,2,44,9],[46,2,46,5],[46,7,46,9],[47,2,47,9],[68,7,68,9],[45,2,45,9],[128,2,128,9],[133,2,133,5],[130,2,130,5],[130,7,130,9],[115,5,115,7],[113,2,113,5],[113,7,113,9],[110,2,110,5],[110,7,110,9],[111,2,111,9],[112,2,112,5],[112,7,112,9],[131,2,131,9],[133,7,133,9],[118,0,118,2],[118,3,118,4],[118,5,118,7],[118,8,118,9],[119,0,119,2],[119,3,119,4],[119,5,119,7],[119,8,119,9],[120,0,120,2],[120,3,120,4],[141,7,141,9],[142,2,142,5],[142,7,142,9],[146,2,146,9],[162,8,162,9],[64,2,64,9],[160,2,160,5],[160,7,160,9],[162,5,162,7],[71,5,71,7],[159,2,159,5],[159,7,159,9],[137,2,137,9],[153,5,153,7],[157,7,157,9],[158,2,158,9],[157,2,157,5],[151,2,151,5],[151,7,151,9],[144,8,144,9],[129,2,129,9],[115,8,115,9],[132,2,132,5],[132,7,132,9],[93,7,93,9],[95,8,95,9],[91,2,91,9],[90,2,90,5],[71,8,71,9],[108,2,108,9],[93,2,93,5],[156,2,156,9],[155,2,155,9],[135,8,135,9],[153,8,153,9],[149,2,149,9],[150,2,150,5],[150,7,150,9],[147,2,147,9],[148,2,148,5],[148,7,148,9],[139,2,139,5],[139,7,139,9],[135,5,135,7],[144,5,144,7],[138,2,138,9],[140,2,140,9],[141,2,141,5],[48,2,48,5],[90,7,90,9],[89,2,89,9],[88,2,88,9],[67,2,67,9],[68,2,68,5],[48,7,48,9],[51,8,51,9],[51,5,51,7],[73,7,73,9],[74,2,74,5],[74,6,74,8],[69,2,69,5],[69,7,69,9],[56,0,56,2],[56,3,56,4],[56,5,56,7],[56,8,56,9],[57,0,57,2],[57,3,57,4],[57,5,57,7],[57,8,57,9],[58,0,58,2],[58,3,58,4],[29,2,29,5],[29,7,29,9],[19,2,19,5],[19,7,19,9],[20,2,20,5],[20,7,20,9],[24,2,24,9],[25,2,25,9],[26,2,26,5],[26,7,26,9],[28,2,28,5],[28,7,28,9],[2,0,2,9],[5,2,5,9],[7,2,7,9],[8,2,8,5],[8,7,8,9],[6,2,6,9],[13,5,13,7],[18,2,18,9],[9,2,9,9],[10,2,10,5],[10,7,10,9],[11,2,11,5],[11,7,11,9],[13,8,13,9],[15,2,15,9],[16,2,16,9],[17,2,17,5],[17,7,17,9]]}
[]
["Exhibit 2.1 - QUALIFIED DEVELOPMENT TEAM CONTACT INFORMATION"]
[]
[]
["DEVELOPMENT NAME",null,{"$f":"Application!D50","v":0},null,null,null,"APPLICANT",{"$f":"Application!D10","v":0}]
["APPLICANT"]
["(Owner/Mortgagor):",null,{"$f":"Application!D10","v":0}]
[null,"Address:",{"$f":"Application!D12","v":0}]
[null,null,{"$f":"CONCATENATE(Application!D14,\", \",Application!H14,\" \",\"0\",Application!J14)","v":",  0"},null,null,null,"Website:",{"$f":"Application!D22","v":0}]
[null,"Principal(s):"]
[null,"Contact Person:",{"$f":"Application!D16","v":0},null,null,null,"Email Address:",{"$f":"Application!D20","v":0}]
[null,"Telephone Number:",{"$f":"Application!D18","v":0}]
[]
[null,"Identity of interests:",null,null,"Entity:"]
["DEVELOPER"]
["(Legal Name):"]
[null,"Address:"]
[null,null,null,null,null,null,"Website:"]
[null,"Principal(s):"]
[null,"Contact Person:",null,null,null,null,"Email Address:"]
{"$rows_left_out":144}
{"sheet":"Development Schedule","index":4,"n_rows":54,"n_cols":12,"rows_kept":54,"cut":false,"hidden":false,"merged":[[40,2,40,6],[46,2,46,6],[41,2,41,6],[42,2,42,6],[43,2,43,6],[44,2,44,6],[45,2,45,6],[35,2,35,6],[36,2,36,6],[37,2,37,6],[38,2,38,6],[39,2,39,6],[30,2,30,6],[31,2,31,6],[32,2,32,6],[33,1,33,6],[34,2,34,6],[25,1,25,6],[26,2,26,6],[27,2,27,6],[28,2,28,6],[29,1,29,6],[20,2,20,6],[21,2,21,6],[22,2,22,6],[23,2,23,6],[24,2,24,6],[15,2,15,6],[16,2,16,6],[17,2,17,6],[18,2,18,6],[19,2,19,6],[0,4,0,6],[49,3,49,5],[53,0,53,3],[50,0,50,1],[1,0,1,6],[4,1,4,2],[4,4,4,6],[2,0,2,6],[6,0,7,0],[6,2,7,6],[9,2,9,6],[10,2,10,6],[11,2,11,6],[12,2,12,6],[13,2,13,6],[14,2,14,6]]}
[null,null,null,null,"Version 2.0:11/2013\n"]
["Exhibit 3.6 - DEVELOPMENT SCHEDULE"]
[]
[]
["DEVELOPMENT NAME",{"$f":"Application!D50","v":0},null,"APPLICANT",{"$f":"Application!D10","v":0}]
[]
["Activity","Date:","Current Status Comments"]
[null,"Month/Year"]
[]
["Current Year:"]
["Site:"]
["Option/Contract"]
["Site Acquisition"]
["Zoning Approval"]
["Site Analysis"]
["Financing:"]
["Construction Loan"]
["Loan Application"]
["Conditional Commitment"]
["Firm Commitment"]
{"$rows_left_out":35}
{"sheet":"Rental Income Calc Worksheet","index":5,"n_rows":77,"n_cols":28,"rows_kept":77,"cut":false,"hidden":false,"merged":[[1,0,1,8],[2,0,2,8],[4,2,4,4],[4,6,4,8],[55,8,57,8],[53,0,53,8],[6,7,6,8],[6,2,6,3],[8,0,8,8],[23,0,23,3],[23,4,23,8],[10,1,11,1],[10,2,10,3],[20,0,20,3],[25,0,25,15],[10,4,10,9]]}
[]
["Exhibit 4.1 - RENTAL INCOME CALCULATION WORKSHEET"]
[]
[]
[null,"DEVELOPMENT NAME",{"$f":"Application!D50","v":0},null,null,"APPLICANT",{"$f":"Application!D10","v":0}]
[]
[null,"Current Year",{"$f":"'Development Schedule'!B10","v":0},null,null,null,"Proforma Stabilized Year (PSY)",{"$f":"'Development Schedule'!B46","v":0}]
[]
["UTILITY ALLOWANCE"]
[]
[null,"Indicate Energy Source (e.g.: gas, electric)","\"X\" all that Apply",null,"Enter Current Year Tenant Paid Utility Allowance for all that Apply"]
[null,null,"Owner Paid","Tenant Paid","0BR","1BR","2BR","3BR","4BR","5BR"]
["Heating"]
["Hot Water"]
["Cooking"]
["Lighting"]
["Air Cond."]
["Refrigerator"]
["Range"]
["Other"]
{"$rows_left_out":58}
{"sheet":"DEVBGT","index":6,"n_rows":85,"n_cols":16,"rows_kept":85,"cut":false,"hidden":false,"merged":[[82,0,82,7],[84,6,84,7],[72,0,72,1],[73,0,73,1],[74,0,74,1],[77,0,77,2],[77,3,77,7],[78,1,78,2],[80,0,80,2],[79,1,79,2],[65,0,65,1],[39,0,39,1],[40,0,40,1],[42,0,42,1],[42,15,42,16],[50,0,50,1],[51,0,51,1],[52,0,52,1],[54,0,54,1],[54,15,54,16],[55,0,55,1],[55,15,55,16],[29,15,29,16],[15,0,15,1],[16,0,16,1],[17,0,17,1],[18,0,18,1],[20,0,20,1],[20,15,20,16],[25,0,25,1],[26,0,26,1],[27,0,27,1],[28,0,28,1],[29,0,29,1],[1,0,1,11],[4,1,4,2],[4,4,4,6],[6,2,9,2],[6,3,9,3],[6,5,6,10],[7,10,9,10],[2,0,2,10]]}
[]
["Exhibit 4.2 - DEVELOPMENT BUDGET"]
[]
[]
["DEVELOPMENT NAME",{"$f":"Application!D50","v":0},null,"APPLICANT",{"$f":"Application!D10","v":0}]
[]
[null,null,"% ","BUDGET","TAX CREDIT ELIGIBLE BASIS","FINANCE PLAN"]
[null,null,null,null,"70% NPV - 9% or",null,null,null,null,null,"Total"]
[null,null,null,null,"30% NPV - 4% "]
[null,null,null,null,"(New / Rehab.)"]
["SITE & IMPROVEMENTS (Div. 1-16) Hard Costs",null,null,null,{"$f":"D11","v":0},null,null,null,null,null,{"$f":"SUM(F11:J11)","v":0}]
["GENERAL REQUIREMENTS (Max. 9% Site + Improvements)  ",null,{"$f":"IFERROR(D12/D11,\"-\")","v":"-"},null,{"$f":"D12","v":0},null,null,null,null,null,{"$f":"SUM(F12:J12)","v":0}]
["OVERHEAD and PROFIT ( Max. 7% Site + Improvements)",null,{"$f":"IFERROR(D13/D11,\"-\")","v":"-"},null,0,null,null,null,null,null,0]
["BOND PREMIUM / L.O.C. COST",null,null,null,0,null,null,null,null,null,0]
["BUILDING PERMITS and OTHER DEVELOPMENT FEES",null,null,null,0,null,null,null,null,null,0]
["CONSTRUCTION (Project Cost Summary) Sub-Total  ",null,null,{"$f":"SUM(D11:D15)","v":0},{"$f":"SUM(E11:E15)","v":0},{"$f":"SUM(F11:F15)","v":0},0,0,0,0,0]
["Other",null,null,null,0,null,null,null,null,null,0]
["Other",null,null,null,0,null,null,null,null,null,0]
["Other",null,null,null,0,null,null,null,null,null,0]
["CONSTRUCTION CONTINGENCY (10% Max) (% Const. >)",null,{"$f":"IFERROR(D20/D16,\"-\")","v":"-"},null,{"$f":"D20*0.5","v":0},null,null,null,null,null,0]
{"$rows_left_out":66}
{"sheet":"Cash Flow","index":7,"n_rows":102,"n_cols":46,"rows_kept":102,"cut":false,"hidden":false,"merged":[[1,3,1,6],[4,33,4,34],[4,2,4,3],[4,7,4,8],[4,14,4,15],[4,22,4,23]]}
[]
[null,null,null,"Exhibit 4.3 - CASH FLOW PROJECTION"]
[]
[]
[null,"DEVELOPMENT NAME",{"$f":"Application!D50","v":0},null,null,null,"APPLICANT",{"$f":"Application!D10","v":0}]
[]
["INCOME",null,null,null,null,null,1,{"$f":"G7+1","v":2},3,4,5,6,7,8,9,10,11,12,13,14,15,16,17,18,19,20,21,22,23,24,25,26,27,28,29,30,31,32,33,34,35,36,37,38,39,40]
[null,null,null,null,"Growth %",null,{"$f":"'Development Schedule'!B46","v":0},{"$f":"G8+1","v":1},2,3,4,5,6,7,8,9,10,11,12,13,14,15,16,17,18,19,20,21,22,23,24,25,26,27,28,29,30,31,32,33,34,35,36,37,38,39]
[]
[null,null,null,"RESIDENTIAL - Qualified / Afford. Gross Rental Income",0.02,null,{"$f":"SUMIF('Rental Income Calc Worksheet'!B31:B49,\"<100%\",'Rental Income Calc Worksheet'!N31:N49)","v":0},{"$f":"G10*(1+$E10)","v":0},0,0,0,0,0,0,0,0,0,0,0,0,0,0,0,{"$f":"W10*(1+$E10)","v":0},0,0,0,0,0,0,0,0,0,0,0,0,0,0,0,0,0,0,0,0,0,0]
[null,null,null,"- RESIDENTIAL - Qualified / Afford. Vacancy Loss",0.02,null,{"$f":"SUMIF('Rental Income Calc Worksheet'!B31:B49,\"<100%\",'Rental Income Calc Worksheet'!S31:S49)","v":0},{"$f":"G11*(1+$E11)","v":0},0,0,0,0,0,0,0,0,0,0,0,0,0,0,0,0,0,0,0,0,0,0,0,0,0,0,0,0,0,0,0,0,0,0,0,0,0,0]
[null,null,null,"= RESIDENTIAL - Qualified / Afford. Net Rental Income",0.02,null,{"$f":"SUMIF('Rental Income Calc Worksheet'!B31:B49,\"<100%\",'Rental Income Calc Worksheet'!P31:P49)","v":0},{"$f":"G12*(1+$E12)","v":0},{"$f":"H12*(1+$E12)","v":0},0,0,0,0,0,0,0,0,0,0,0,0,0,0,0,0,0,0,0,0,0,0,0,0,0,0,0,0,0,0,0,0,0,0,0,0,0]
[null,null,null,"RESIDENTIAL - Market Rate Gross Rental Income",0.02,null,{"$f":"SUMIF('Rental Income Calc Worksheet'!B31:B49,\">=100%\",'Rental Income Calc Worksheet'!N31:N49)+SUMIF('Rental Income Calc Worksheet'!B31:B49,\"120%+\",'Rental Income Calc Worksheet'!N31:N49)","v":0},{"$f":"G13*(1+$E13)","v":0},0,0,0,0,0,0,0,0,0,0,0,0,0,0,0,0,0,0,0,0,0,0,0,0,0,0,0,0,0,0,0,0,0,0,0,0,0,0]
[null,null,null,"- RESIDENTIAL - Market Rate Vacancy Loss",0.02,null,{"$f":"SUMIF('Rental Income Calc Worksheet'!B31:B49,\">=100%\",'Rental Income Calc Worksheet'!S31:S49)+SUMIF('Rental Income Calc Worksheet'!B31:B49,\"120%+\",'Rental Income Calc Worksheet'!S31:S49)","v":0},{"$f":"G14*(1+$E14)","v":0},0,0,0,0,0,0,0,0,0,0,0,0,0,0,0,0,0,0,0,0,0,0,0,0,0,0,0,0,0,0,0,0,0,0,0,0,0,0]
[null,null,null,"= RESIDENTIAL - Market Rate Net Rental Income",0.02,null,{"$f":"SUMIF('Rental Income Calc Worksheet'!B31:B49,\">=100%\",'Rental Income Calc Worksheet'!P31:P49)+SUMIF('Rental Income Calc Worksheet'!B31:B49,\"120%+\",'Rental Income Calc Worksheet'!P31:P49)","v":0},{"$f":"G15*(1+$E15)","v":0},0,0,0,0,0,0,0,0,0,0,0,0,0,0,0,0,0,0,0,0,0,0,0,0,0,0,0,0,0,0,0,0,0,0,0,0,0,0]
[null,null,null,"Other Income",0.02,null,null,{"$f":"G16*(1+$E16)","v":0},0,0,0,0,0,0,0,0,0,0,0,0,0,0,0,0,0,0,0,0,0,0,0,0,0,0,0,0,0,0,0,0,0,0,0,0,0,0]
[null,null,null,null," EFFECTIVE GROSS INCOME (EGI)  ",null,{"$f":"G12+G15+G16","v":0},{"$f":"H12+H15+H16","v":0},0,0,0,0,0,0,0,0,0,0,0,0,0,0,0,0,0,0,0,0,0,0,0,0,0,0,0,0,0,0,0,0,0,0,0,0,0,0]
[]
["EXPENSES",null,null,"Administrative",0.03,null,null,{"$f":"G19*(1+$E19)","v":0},{"$f":"H19*(1+$E19)","v":0},0,0,0,0,0,0,0,0,0,0,0,0,0,0,0,0,0,0,0,0,0,0,0,0,0,0,0,0,0,0,0,0,0,0,0,0,0]
[null,null,null,"Maintenance",0.03,null,null,{"$f":"G20*(1+$E20)","v":0},0,0,0,0,0,0,0,0,0,0,0,0,0,0,0,0,0,0,0,0,0,0,0,0,0,0,0,0,0,0,0,0,0,0,0,0,0,0]
{"$rows_left_out":83}
{"sheet":"Sources of Funds","index":8,"n_rows":60,"n_cols":12,"rows_kept":60,"cut":false,"hidden":false,"merged":[[1,0,1,12],[4,8,4,10],[11,6,11,12],[12,6,12,12],[9,6,9,12],[10,6,10,12],[2,0,2,12],[4,2,4,5],[42,11,42,12],[32,11,32,12],[33,11,33,12],[35,11,35,12],[37,11,37,12],[34,11,34,12],[22,6,22,12],[41,11,41,12],[13,6,13,12],[21,6,21,12],[14,6,14,12],[36,11,36,12],[38,11,38,12],[39,11,39,12],[40,11,40,12],[30,11,30,12],[23,6,23,12],[31,11,31,12],[27,11,27,12]]}
[]
["Exhibit 4.8- SOURCES OF FUNDS"]
[]
[]
["DEVELOPMENT NAME",null,{"$f":"Application!D50","v":0},null,null,null,null,"APPLICANT",{"$f":"Application!D10","v":0}]
[]
[null,null,"Construction",null,"Permanent","Grant "]
["EQUITY CAPITAL, GRANTS, Etc.",null,"Sources",null,"Sources","[Y] or [N]"]
[]
["DOH / HUD HOME Funds"]
["DOH Affordable Housing Program - FLEX"]
["DOH Housing Trust Fund"]
["DOH / HUD CDBG Small Cities Funds"]
["DOH $300MM Housing Portfolio"]
["Other Public Funds [ Specify ]"]
["Federal LIHTC Net Proceeds",null,null,null,null,"N/A"]
["Federal Historic Tax Credit Net Proceeds",null,null,null,null,"N/A"]
["State Historic Tax Credit Net Proceeds",null,null,null,null,"N/A"]
["CT HTCC Tax Credit Proceeds",null,null,null,null,"N/A"]
["Developer / Investor Cash Equity",null,null,null,null,"N/A"]
{"$rows_left_out":41}
{"sheet":"Sworn Cert","index":9,"n_rows":44,"n_cols":8,"rows_kept":44,"cut":false,"hidden":false,"merged":[[42,0,42,5],[42,7,42,8],[43,7,43,8],[32,0,32,5],[32,7,32,9],[35,4,35,5],[38,2,38,10],[39,2,39,10],[40,0,40,5],[27,0,27,4],[27,6,27,8],[30,0,30,4],[30,7,30,9],[21,2,21,10],[25,0,25,4],[23,2,23,10],[11,2,11,10],[13,2,13,10],[17,2,17,10],[19,2,19,10],[1,0,1,11],[6,0,6,11],[8,1,8,10],[4,2,4,4],[4,7,4,9],[2,0,2,11]]}
[null,null,null," "]
["SWORN CERTIFICATE OF NON-DISPLACEMENT"]
[]
[]
[null,"DEVELOPMENT NAME",0,null,null,null,"APPLICANT",0]
[]
["SWORN CERTIFICATION OF NONDISPLACEMENT/NO LOSS OF UNITS IN LIEU OF RESIDENTIAL ANTIDISPLACEMENT AND RELOCATION PLAN – VACANT LAND OR VACANT BUILDINGS WITH SAME NUMBER OF RESIDENTIAL UNITS OR OWNER-OCCUPIED SINGLE FAMILY ACCESSIBILITY MODIFICATIONS"]
[]
[null,"I have read the requirements of the Federal Uniform Relocation Assistance and Real Property Acquisition Policies Act of 1970, as amended (URA) and Section 104 (d) of the Housing and Community Development Act of 1974, as amended (Barney Frank) and (CGS Chapter 135, Uniform Relocation Assistance Act) ; and having been duly sworn, do hereby certify that:"]
[null,"Check off all provisions that apply:"]
[]
["1.",null,"Because the proposed housing will be developed on completely vacant land, that has no active businesses, farm operations or nonprofit uses, the development will not cause any temporary or permanent displacement."]
[]
["2.",null,"Because the proposed housing will be developed in completely vacant structures, which have been vacant for at least one year prior to any contact with the Department of Economic and Community Development and/or the Connecticut Housing Finance Authority and which contain no active businesses, farm operations or nonprofit uses, the development will not cause any temporary or permanent displacement."]
[]
["3.",null,"There will be no demolition of residential units or portions of residential units."]
[]
["4.",null,"There will be no conversion of residential units to uses other than lower income dwelling units.  (“Other non-residential uses” includes emergency shelters.)"]
[]
["5.",null,"All occupied and vacant occupiable lower income dwelling units that are demolished or converted to other uses shall be replaced on a one-for-one basis with comparable lower income dwelling units.  If Section 104(d) applies: “Occupiable” is defined as occupied at any time (except by squatters) within a 3-month period prior to execution of a contract for demolition or rehabilitation; a unit in standard condition; or a substandard unit that is suitable for rehabilitation.  Replacement units shall meet federal requirements at 42.375(b) (1)-(5) of 24 CFR Part 42, effective 11/4/96."]
{"$rows_left_out":25}
{"sheet":"Fin Asst Wksht","index":10,"n_rows":111,"n_cols":20,"rows_kept":111,"cut":false,"hidden":false,"merged":[[3,2,3,10],[4,2,4,4],[12,0,12,10],[8,2,8,10],[9,2,9,4],[9,8,9,10],[4,8,4,10],[62,5,62,6],[62,9,62,10],[46,0,46,4],[47,7,47,8],[49,7,49,8],[51,7,51,8],[53,7,53,8],[58,0,58,8],[61,5,61,6],[84,7,84,8],[72,5,72,6],[72,9,72,10],[74,9,74,10],[76,9,76,10],[79,5,79,6],[80,5,80,6],[110,8,110,10],[104,4,104,5],[106,0,107,6],[106,8,107,10],[90,0,90,4],[90,7,90,8],[108,8,108,10],[109,0,109,6],[109,8,109,10],[95,0,95,10],[88,0,88,6],[88,7,88,8],[88,9,88,10],[85,0,85,10],[86,0,86,10],[0,0,0,10],[60,9,60,10],[61,9,61,10],[37,0,37,10],[44,2,44,5],[44,7,44,8],[40,7,40,8],[38,7,38,8],[41,7,41,8],[42,7,42,8],[18,1,18,2],[18,5,18,7],[39,7,39,8],[13,0,13,10],[14,0,14,10],[3,0,3,1],[64,5,64,6],[64,9,64,10],[66,5,66,6],[66,9,66,10],[68,5,68,6],[68,9,68,10]]}
["FINANCIAL Assistance Worksheet"]
[]
["Section 1. Borrower Information "]
["Borrower Name:"]
["Phone Number:",null,null,null,null,null,"Fax Number:"]
[]
["Section 2. Development Description"]
[]
["Development Name:"]
["CHFA Number(s):",null,null,null,null,null,"State Number(s):"]
[]
["Work Items - List below all work that needs to be performed:"]
[]
[]
[]
[]
[]
["Estimated Cost of this Rehab Project:"]
["Hard:",null,null,null,"Soft:",null,null,null,null,"Total:",""]
[]
{"$rows_left_out":91}