{"text_format":"1","workbook":"xlsx","n_sheets":12,"sheets":["Instructions","Exhibit Checklist","Application","2.1 Dev Team Info","3.7 Development Schedule","3.14 Sworn Cert","3.16 Fincl Asst Wksht","4.1 Rental Income Calc Wrksht","4.2 Exploded Trade Breakdown","4.3 Estmd Development Budget","4.4 Cash Flow Projection","4.8 Sources of Funds"],"not_rendered":{"charts":0,"images":14,"macros":1,"external_links":0,"defined_names":22,"comments":7,"pivot_tables":0},"unopened":[],"bounds":{"document_bytes":16777216,"sheet_cells":100000,"rows_first":2000,"rows_last":500,"rows_between":2000,"halvings":0,"cell_chars":16384,"cell_head_chars":4096},"cells_cut":0,"cells_raw":0,"read":"whole","date_system":"1900"}

{"sheet":"Instructions","index":0,"n_rows":37,"n_cols":2,"rows_kept":37,"cut":false,"hidden":false,"merged":[[2,0,2,2],[30,0,31,0]]}
[]
[]
["WORKBOOK INSTRUCTIONS"]
[]
[]
["Security/Macros:","This Consolidated Application (Short Version) contains numerous Excel macros, meaning that various worksheets share information.  To allow the macros to work properly, the security setting on your Microsoft Excel program must be turned to LOW.  For Windows XP and lower, this is done through TOOLS->MACRO->SECURITY.  See screenshot below.  After setting security to LOW, close out of excel and re-open the document.  For Windows VISTA, click the Microsoft Office Button          and then click Excel Options. In the Trust Center category, click Trust Center Settings, and then click the Macro Settings category and set the security to low.  For Windows 7, choose File, Options, Trust Center and click on Trust Center Settings.  Set the macro security to low.\n"]
[]
[]
[]
[]
[]
[]
[]
[]
[]
{"$rows_left_out":23}
{"sheet":"Exhibit Checklist","index":1,"n_rows":44,"n_cols":20,"rows_kept":44,"cut":false,"hidden":false,"merged":[[16,10,16,11],[43,10,43,11],[41,10,41,11],[42,10,42,11],[18,10,18,11],[20,10,20,11],[24,10,24,11],[38,10,38,11],[40,10,40,11],[21,10,21,11],[22,10,22,11],[33,10,33,11],[34,10,34,11],[35,10,35,11],[36,10,36,11],[39,10,39,11],[17,2,17,3],[13,2,13,3],[3,0,3,19],[12,0,12,3],[7,14,7,15],[11,12,11,18],[7,6,7,13],[7,16,7,19],[5,0,5,19],[17,0,17,1],[13,0,13,1],[17,4,17,5],[13,4,13,5],[11,19,12,19],[14,10,14,11],[15,10,15,11],[1,5,1,14],[11,0,11,11],[12,4,12,11],[13,13,13,18],[13,8,13,9],[13,10,13,11],[13,6,13,7],[2,17,2,19],[37,4,37,5],[37,6,37,7],[37,8,37,9],[37,10,37,11],[23,4,23,5],[23,6,23,7],[23,8,23,9],[23,10,23,11],[25,10,25,11],[26,10,26,11],[27,10,27,11],[28,10,28,11],[29,10,29,11],[30,10,30,11],[31,10,31,11],[32,10,32,11],[19,4,19,5],[19,6,19,7],[19,8,19,9],[19,10,19,11],[17,8,17,9],[17,6,17,7],[17,10,17,11]]}
[]
[null,null,null,null,"SUBMISSION DATE"]
[null,null,null,null,null,null,null,null,null,null,null,null,null,null,null,null,null,"Version 2.1: 4/14\n"]
["EXHIBIT CHECKLIST"]
[]
[]
[]
[null,null,null,null,null,"DEVELOPMENT NAME",{"$f":"IF(ISBLANK(Application!D49), \"\", Application!D49)","v":""},null,null,null,null,null,null,null,"APPLICANT",null,{"$f":"IF(ISBLANK(Application!D11), \"\", Application!D11)","v":""}]
[]
[]
[]
["\"X\" if submitted ",null,null,null,null,null,null,null,null,null,null,null,"THIS FORM MUST BE SUBMITTED WITH APPLICATION",null,null,null,null,null,null,"CHFA/ DOH use only"]
[]
[null,null,null,null,null,null,null,null,null,null,null,null,"Exhibit Number"]
[null,null,null,null,null,null,null,null,null,null,null,null,"A","Completed Exhibit Checklist (Form Provided)"]
{"$rows_left_out":30}
{"sheet":"Application","index":2,"n_rows":259,"n_cols":14,"rows_kept":259,"cut":false,"hidden":false,"merged":[[113,2,113,9],[211,2,211,8],[212,2,212,8],[247,2,247,8],[36,2,36,4],[210,2,210,8],[207,2,207,8],[214,2,214,8],[196,4,197,4],[196,5,197,5],[200,4,200,5],[201,4,201,5],[70,4,70,7],[50,3,50,5],[143,7,143,8],[96,2,96,3],[97,2,97,8],[180,2,180,9],[181,2,181,9],[62,5,62,6],[232,2,232,8],[82,6,82,7],[103,7,103,8],[182,2,182,9],[65,2,65,3],[122,0,122,9],[125,2,125,5],[2,0,2,9],[5,0,5,9],[10,3,10,5],[12,3,12,5],[3,0,3,9],[14,3,14,5],[18,3,18,4],[18,7,18,9],[16,7,16,9],[20,7,20,9],[29,3,29,4],[16,3,16,5],[32,0,32,9],[20,3,20,4],[22,3,22,4],[22,7,22,9],[124,2,124,7],[81,6,81,7],[116,7,116,8],[37,2,37,9],[40,2,40,9],[42,2,42,9],[41,6,41,7],[64,2,64,3],[83,6,83,7],[168,0,168,9],[76,2,76,3],[204,2,204,8],[63,5,63,6],[66,5,66,6],[63,7,63,8],[66,7,66,8],[62,7,62,8],[75,2,75,3],[177,2,177,9],[68,2,68,9],[69,2,69,9],[185,2,185,9],[171,2,171,9],[66,2,66,3],[184,2,184,3],[143,2,143,4],[143,5,143,6],[103,2,103,5],[128,6,128,7],[216,0,216,9],[71,2,71,3],[236,2,236,8],[242,2,242,8],[243,2,243,8],[1,3,1,6],[74,2,74,9],[81,2,81,5],[83,2,83,5],[84,2,84,5],[85,2,85,5],[86,2,86,5],[45,0,45,9],[48,3,48,9],[90,2,90,9],[72,2,72,3],[218,2,218,8],[50,7,50,9],[52,3,52,5],[55,2,55,9],[56,2,56,9],[63,2,63,3],[65,5,65,6],[65,7,65,8],[220,2,220,8],[245,0,245,9],[253,1,253,9],[254,1,254,9],[250,1,250,5],[250,6,250,9],[246,2,246,8],[248,2,248,8],[252,1,252,9],[231,2,231,8],[229,2,229,8],[235,2,235,8],[221,2,221,8],[222,2,222,8],[223,2,223,8],[224,3,224,8],[225,3,225,8],[227,0,227,9],[234,2,234,8],[233,2,233,8],[241,2,241,8],[130,6,130,7],[131,6,131,7],[140,2,140,8],[144,2,144,4],[152,5,152,6],[152,7,152,8],[145,5,145,6],[145,7,145,8],[146,2,146,4],[146,5,146,6],[146,7,146,8],[145,2,145,4],[152,2,152,4],[144,7,144,8],[151,5,151,6],[151,7,151,8],[112,2,112,3],[125,6,125,7],[126,6,126,7],[161,2,161,4],[161,5,161,6],[161,7,161,8],[153,2,153,4],[153,5,153,6],[153,7,153,8],[154,2,154,4],[154,5,154,6],[154,7,154,8],[155,2,155,4],[155,5,155,6],[155,7,155,8],[159,2,159,4],[159,5,159,6],[159,7,159,8],[160,2,160,4],[160,5,160,6],[160,7,160,8],[127,6,127,7],[129,6,129,7],[144,5,144,6],[162,7,162,8],[163,2,163,4],[163,5,163,6],[163,7,163,8],[82,2,82,5],[94,2,94,7],[149,2,149,4],[157,2,157,4],[104,2,104,7],[107,2,107,7],[86,6,86,7],[84,6,84,7],[85,6,85,7],[147,2,147,4],[147,5,147,6],[147,7,147,8],[139,2,139,3],[126,2,126,5],[127,2,127,5],[128,2,128,5],[129,2,129,5],[131,2,131,5],[132,2,132,5],[151,2,151,4],[79,2,79,3],[209,2,209,3],[64,5,64,6],[64,7,64,8],[77,2,77,3],[174,2,174,7],[58,2,60,9],[179,2,179,8],[240,2,240,8],[237,2,237,8],[238,2,238,8],[239,2,239,8],[109,2,109,3],[110,2,110,3],[87,2,87,7],[115,2,115,7],[117,2,117,8],[120,2,120,7],[136,2,136,7],[137,2,137,8],[93,2,93,7],[100,2,100,8],[162,2,162,4],[162,5,162,6]]}
[]
[null,null,null,"State-Sponsored Housing Portfolio"]
[" Application for ",null,null,null,null,null,null,null,null,null,"Version 2.1:  4/10/2014"]
[" Rental Development and Rehabilitation Projects"]
[]
["SECTION I.  APPLICANT "]
[]
["Applicant Information"]
[null,1.1000000000000001,"Applicant (Owner/Mortgagor)"]
[]
[null,null,"Applicant Name"]
[]
[null,null,"Applicant Address"]
[]
[null,null,"City",null,null,null,"State",null,"Zip"]
{"$rows_left_out":245}
{"sheet":"2.1 Dev Team Info","index":3,"n_rows":171,"n_cols":13,"rows_kept":171,"cut":false,"hidden":false,"merged":[[107,0,107,2],[108,0,108,2],[109,0,109,2],[107,3,107,4],[103,1,103,7],[107,8,107,9],[108,8,108,9],[109,8,109,9],[110,8,110,9],[108,3,108,4],[109,3,109,4],[110,3,110,4],[107,5,107,7],[108,5,108,7],[109,5,109,7],[134,0,134,2],[134,3,134,4],[134,5,134,7],[134,8,134,9],[131,0,131,2],[131,3,131,4],[131,5,131,7],[131,8,131,9],[132,0,132,2],[132,3,132,4],[132,5,132,7],[132,8,132,9],[133,0,133,2],[133,3,133,4],[133,5,133,7],[133,8,133,9],[128,5,128,7],[128,8,128,9],[129,0,129,2],[129,3,129,4],[129,5,129,7],[129,8,129,9],[130,0,130,2],[130,3,130,4],[130,5,130,7],[130,8,130,9],[113,5,113,7],[114,5,114,7],[125,0,125,9],[117,2,117,9],[114,0,114,2],[113,0,113,2],[114,8,114,9],[113,8,113,9],[110,5,110,7],[111,5,111,7],[112,5,112,7],[110,0,110,2],[111,0,111,2],[112,0,112,2],[112,8,112,9],[114,3,114,4],[112,3,112,4],[113,3,113,4],[111,8,111,9],[111,3,111,4],[84,0,84,9],[105,0,105,9],[106,0,106,2],[106,3,106,4],[106,5,106,7],[106,8,106,9],[91,0,91,2],[91,3,91,4],[91,5,91,7],[91,8,91,9],[92,0,92,2],[92,3,92,4],[92,5,92,7],[92,8,92,9],[93,0,93,2],[93,3,93,4],[93,5,93,7],[93,8,93,9],[88,5,88,7],[88,8,88,9],[89,5,89,7],[89,8,89,9],[90,0,90,2],[90,3,90,4],[90,5,90,7],[90,8,90,9],[85,0,85,2],[85,3,85,4],[85,5,85,7],[85,8,85,9],[86,5,86,7],[86,8,86,9],[87,5,87,7],[87,8,87,9],[86,0,86,2],[87,0,87,2],[88,0,88,2],[89,0,89,2],[86,3,86,4],[87,3,87,4],[88,3,88,4],[89,3,89,4],[68,0,68,2],[68,3,68,4],[68,5,68,7],[68,8,68,9],[69,0,69,2],[69,3,69,4],[69,5,69,7],[69,8,69,9],[65,5,65,7],[65,8,65,9],[66,0,66,2],[66,3,66,4],[66,5,66,7],[66,8,66,9],[67,0,67,2],[67,3,67,4],[67,5,67,7],[67,8,67,9],[40,0,40,9],[60,0,60,9],[61,0,61,2],[61,3,61,4],[61,5,61,7],[61,8,61,9],[62,0,62,2],[62,3,62,4],[62,5,62,7],[62,8,62,9],[47,0,47,2],[47,3,47,4],[47,5,47,7],[47,8,47,9],[48,0,48,2],[48,3,48,4],[48,5,48,7],[48,8,48,9],[49,0,49,2],[49,3,49,4],[49,5,49,7],[49,8,49,9],[44,0,44,2],[44,3,44,4],[44,5,44,7],[44,8,44,9],[45,0,45,2],[45,3,45,4],[45,5,45,7],[45,8,45,9],[46,0,46,2],[46,3,46,4],[46,5,46,7],[46,8,46,9],[41,0,41,2],[41,3,41,4],[41,5,41,7],[41,8,41,9],[42,0,42,2],[42,3,42,4],[42,5,42,7],[42,8,42,9],[43,0,43,2],[43,3,43,4],[43,5,43,7],[43,8,43,9],[102,5,102,7],[72,2,72,9],[73,2,73,5],[73,7,73,9],[99,2,99,5],[99,7,99,9],[2,0,2,9],[5,2,5,4],[5,7,5,9],[56,2,56,5],[56,7,56,9],[29,5,29,7],[29,8,29,9],[38,8,38,9],[38,5,38,7],[34,2,34,9],[80,2,80,4],[79,2,79,9],[51,2,51,9],[53,2,53,5],[53,7,53,9],[54,2,54,9],[75,7,75,9],[52,2,52,9],[136,2,136,9],[141,2,141,5],[138,2,138,5],[138,7,138,9],[123,5,123,7],[121,2,121,5],[121,7,121,9],[118,2,118,5],[118,7,118,9],[119,2,119,9],[120,2,120,5],[120,7,120,9],[139,2,139,9],[141,7,141,9],[126,0,126,2],[126,3,126,4],[126,5,126,7],[126,8,126,9],[127,0,127,2],[127,3,127,4],[127,5,127,7],[127,8,127,9],[128,0,128,2],[128,3,128,4],[149,7,149,9],[150,2,150,5],[150,7,150,9],[154,2,154,9],[170,8,170,9],[71,2,71,9],[168,2,168,5],[168,7,168,9],[170,5,170,7],[78,5,78,7],[167,2,167,5],[167,7,167,9],[145,2,145,9],[161,5,161,7],[165,7,165,9],[166,2,166,9],[165,2,165,5],[159,2,159,5],[159,7,159,9],[152,8,152,9],[137,2,137,9],[123,8,123,9],[140,2,140,5],[140,7,140,9],[100,7,100,9],[102,8,102,9],[98,2,98,9],[97,2,97,5],[78,8,78,9],[116,2,116,9],[100,2,100,5],[164,2,164,9],[163,2,163,9],[143,8,143,9],[161,8,161,9],[157,2,157,9],[158,2,158,5],[158,7,158,9],[155,2,155,9],[156,2,156,5],[156,7,156,9],[147,2,147,5],[147,7,147,9],[143,5,143,7],[152,5,152,7],[146,2,146,9],[148,2,148,9],[149,2,149,5],[55,2,55,5],[97,7,97,9],[96,2,96,9],[95,2,95,9],[74,2,74,9],[75,2,75,5],[55,7,55,9],[58,8,58,9],[58,5,58,7],[80,7,80,9],[81,2,81,5],[81,6,81,8],[76,2,76,5],[76,7,76,9],[63,0,63,2],[63,3,63,4],[63,5,63,7],[63,8,63,9],[64,0,64,2],[64,3,64,4],[64,5,64,7],[64,8,64,9],[65,0,65,2],[65,3,65,4],[36,2,36,5],[36,7,36,9],[26,2,26,5],[26,7,26,9],[27,2,27,5],[27,7,27,9],[31,2,31,9],[32,2,32,9],[33,2,33,5],[33,7,33,9],[35,2,35,5],[35,7,35,9],[3,0,3,9],[6,2,6,9],[8,2,8,9],[9,2,9,5],[9,7,9,9],[7,2,7,9],[14,5,14,7],[25,2,25,9],[10,2,10,9],[11,2,11,5],[11,7,11,9],[12,2,12,5],[12,7,12,9],[14,8,14,9],[22,2,22,9],[23,2,23,9],[24,2,24,5],[24,7,24,9]]}
[" "]
[]
["Exhibit 2.1 - QUALIFIED DEVELOPMENT TEAM CONTACT INFORMATION"]
[]
[]
["DEVELOPMENT NAME",null,{"$f":"IF(ISBLANK(Application!D49), \"\", Application!D49)","v":""},null,null,null,"APPLICANT",{"$f":"IF(ISBLANK(Application!D11), \"\", Application!D11)","v":""}]
["APPLICANT"]
["(Owner/Mortgagor):",null,{"$f":"IF(ISBLANK(Application!D11),\"\",Application!D11)","v":""}]
[null,"Address:",{"$f":"IF(ISBLANK(Application!D13),\"\",Application!D13)","v":""}]
[null,null,{"$f":"IF(ISBLANK(Application!D15),\"\", Application!D15)","v":""},null,null,null,"State",{"$f":"IF(ISBLANK(Application!H15), \"\", Application!H15)","v":""}]
[null,"Principal(s):"]
[null,"Contact Person:",{"$f":"IF(ISBLANK(Application!D17),\"\",Application!D17)","v":""},null,null,null,"Title",{"$f":"IF(ISBLANK(Application!H17), \"\", Application!H17)","v":""}]
[null,"Telephone Number:",{"$f":"IF(ISBLANK(Application!D19), \"\", Application!D19)","v":""}]
[]
[null,"Identity of interests:",null,null,"Entity:"]
{"$rows_left_out":157}
{"sheet":"3.7 Development Schedule","index":4,"n_rows":55,"n_cols":12,"rows_kept":55,"cut":false,"hidden":false,"merged":[[41,2,41,6],[47,2,47,6],[42,2,42,6],[43,2,43,6],[44,2,44,6],[45,2,45,6],[46,2,46,6],[36,2,36,6],[37,2,37,6],[38,2,38,6],[39,2,39,6],[40,2,40,6],[33,2,33,6],[34,1,34,6],[35,2,35,6],[31,2,31,6],[32,2,32,6],[29,2,29,6],[26,1,26,6],[27,2,27,6],[28,2,28,6],[30,1,30,6],[21,2,21,6],[22,2,22,6],[23,2,23,6],[24,2,24,6],[25,2,25,6],[16,2,16,6],[17,2,17,6],[18,2,18,6],[19,2,19,6],[20,2,20,6],[1,4,1,6],[50,3,50,5],[54,0,54,3],[51,0,51,1],[2,0,2,6],[5,1,5,2],[5,4,5,6],[3,0,3,6],[7,0,8,0],[7,2,8,6],[10,2,10,6],[11,2,11,6],[12,2,12,6],[13,2,13,6],[14,2,14,6],[15,2,15,6]]}
[]
[null,null,null,null,"Version 2.1:  4/14\n"]
["Exhibit 3.7 - DEVELOPMENT SCHEDULE"]
[]
[]
["DEVELOPMENT NAME",{"$f":"IF(ISBLANK(Application!D49), \"\", Application!D49)","v":""},null,"APPLICANT",{"$f":"IF(ISBLANK(Application!D11), \"\", Application!D11)","v":""}]
[]
["Activity","Date:","Current Status Comments"]
[null,"Month/Year"]
[]
["Current Year:"]
["Site:"]
["Option/Contract"]
["Site Acquisition"]
["Zoning Approval"]
{"$rows_left_out":41}
{"sheet":"3.14 Sworn Cert","index":5,"n_rows":47,"n_cols":8,"rows_kept":47,"cut":false,"hidden":false,"merged":[[45,0,45,5],[45,7,45,8],[46,7,46,8],[35,0,35,5],[35,7,35,9],[38,4,38,5],[41,2,41,10],[42,2,42,10],[43,0,43,5],[30,0,30,4],[30,6,30,8],[33,0,33,4],[33,7,33,9],[24,2,24,10],[28,0,28,4],[26,2,26,10],[14,2,14,10],[16,2,16,10],[20,2,20,10],[22,2,22,10],[2,0,2,11],[9,0,9,11],[11,1,11,10],[3,0,3,11],[7,2,7,5],[7,0,7,1],[7,7,7,11]]}
[]
[null,null,null," "]
["SWORN CERTIFICATE OF NON-DISPLACEMENT"]
["Exhibit 3.14"]
[]
[]
[]
["DEVELOPMENT NAME",null,{"$f":"IF(ISBLANK(Application!D49), \"\", Application!D49)","v":""},null,null,null,"APPLICANT",{"$f":"IF(ISBLANK(Application!D11), \"\", Application!D11)","v":""}]
[]
["SWORN CERTIFICATION OF NONDISPLACEMENT/NO LOSS OF UNITS IN LIEU OF RESIDENTIAL ANTIDISPLACEMENT AND RELOCATION PLAN – VACANT LAND OR VACANT BUILDINGS WITH SAME NUMBER OF RESIDENTIAL UNITS OR OWNER-OCCUPIED SINGLE FAMILY ACCESSIBILITY MODIFICATIONS"]
[]
[null,"I have read the requirements of the Federal Uniform Relocation Assistance and Real Property Acquisition Policies Act of 1970, as amended (URA) and Section 104 (d) of the Housing and Community Development Act of 1974, as amended (Barney Frank) and (CGS Chapter 135, Uniform Relocation Assistance Act) ; and having been duly sworn, do hereby certify that:"]
[null,"Check off all provisions that apply:"]
[]
["1.",null,"Because the proposed housing will be developed on completely vacant land, that has no active businesses, farm operations or nonprofit uses, the development will not cause any temporary or permanent displacement."]
{"$rows_left_out":33}
{"sheet":"3.16 Fincl Asst Wksht","index":6,"n_rows":115,"n_cols":20,"rows_kept":115,"cut":false,"hidden":false,"merged":[[6,2,6,10],[7,2,7,4],[15,0,15,10],[11,2,11,10],[12,8,12,10],[7,8,7,10],[12,2,12,5],[89,7,89,8],[77,9,77,10],[79,9,79,10],[81,9,81,10],[84,5,84,6],[85,5,85,6],[77,5,77,6],[89,5,89,6],[114,8,114,10],[109,4,109,5],[111,0,111,6],[111,8,111,10],[95,0,95,4],[95,7,95,8],[112,8,112,10],[113,0,113,6],[113,8,113,10],[100,0,100,10],[105,6,105,7],[93,0,93,6],[93,7,93,8],[93,9,93,10],[90,0,90,10],[91,0,91,10],[73,5,73,6],[73,9,73,10],[1,0,1,10],[65,9,65,10],[66,9,66,10],[40,0,40,10],[47,2,47,5],[47,7,47,8],[43,7,43,8],[41,7,41,8],[44,7,44,8],[45,7,45,8],[21,1,21,2],[21,5,21,7],[42,7,42,8],[16,0,16,10],[2,0,2,10],[69,5,69,6],[69,9,69,10],[71,5,71,6],[71,9,71,10],[17,0,17,10],[6,0,6,1],[67,5,67,6],[67,9,67,10],[49,0,49,4],[50,7,50,8],[52,7,52,8],[54,7,54,8],[56,7,56,8],[63,0,63,8],[66,5,66,6]]}
[]
["FINANCIAL Assistance Worksheet"]
["Exhibit 3.16"]
[]
[]
["Section 1. Borrower Information "]
["Borrower Name:",null,{"$f":"IF(ISBLANK(Application!D11), \"\", Application!D11)","v":""}]
["Phone Number:",null,{"$f":"IF(ISBLANK(Application!D19), \"\", Application!D19)","v":""},null,null,null,"Fax Number:",null,{"$f":"IF(ISBLANK(Application!H19), \"\", Application!H19)","v":""}]
[]
["Section 2. Development Description"]
[]
["Development Name:",null,{"$f":"IF(ISBLANK(Application!D49),\"\",Application!D49)","v":""}]
["CHFA Number(s):",null,null,null,null,null,"State Number(s):"]
[]
["Work Items - List below all work that needs to be performed:"]
{"$rows_left_out":101}
{"sheet":"4.1 Rental Income Calc Wrksht","index":7,"n_rows":78,"n_cols":28,"rows_kept":78,"cut":false,"hidden":false,"merged":[[2,0,2,8],[3,0,3,8],[5,2,5,4],[5,6,5,8],[56,8,58,8],[54,0,54,8],[7,7,7,8],[7,2,7,3],[9,0,9,8],[24,0,24,3],[24,4,24,8],[11,1,12,1],[11,2,11,3],[21,0,21,3],[26,0,26,15],[11,4,11,9]]}
[]
[]
["Exhibit 4.1 - RENTAL INCOME CALCULATION WORKSHEET"]
[]
[]
[null,"DEVELOPMENT NAME",{"$f":"IF(ISBLANK(Application!D49), \"\", Application!D49)","v":""},null,null,"APPLICANT",{"$f":"IF(ISBLANK(Application!D11), \"\", Application!D11)","v":""}]
[]
[null,"Current Year",{"$f":"IF(ISBLANK('3.7 Development Schedule'!B11),\"\",'3.7 Development Schedule'!B11)","v":""},null,null,null,"Proforma Stabilized Year (PSY)",{"$f":"IF(ISBLANK('3.7 Development Schedule'!B47), \"\", '3.7 Development Schedule'!B47)","v":""}]
[]
["UTILITY ALLOWANCE"]
[]
[null,"Indicate Energy Source (e.g.: gas, electric)","\"X\" all that Apply",null,"Enter Current Year Tenant Paid Utility Allowance for all that Apply"]
[null,null,"Owner Paid","Tenant Paid","0BR","1BR","2BR","3BR","4BR","5BR"]
["Heating"]
["Hot Water"]
{"$rows_left_out":64}
{"sheet":"4.2 Exploded Trade Breakdown","index":8,"n_rows":375,"n_cols":14,"rows_kept":375,"cut":false,"hidden":false,"merged":[[7,12,8,12],[7,13,8,13],[9,3,9,5],[9,6,9,8],[1,0,1,9],[2,0,2,9],[3,0,3,5],[5,3,5,5],[5,8,5,9],[5,12,5,13],[121,3,121,5],[121,6,121,8],[7,3,7,5],[7,6,7,8],[7,9,8,9],[39,1,40,1],[96,3,96,5],[96,6,96,8],[110,3,110,5],[110,6,110,8],[132,3,132,5],[132,6,132,8],[155,3,155,5],[155,6,155,8],[186,3,186,5],[186,6,186,8],[202,3,202,5],[202,6,202,8],[232,3,232,5],[232,6,232,8],[248,3,248,5],[248,6,248,8],[352,3,352,5],[352,6,352,8],[270,3,270,5],[270,6,270,8],[279,3,279,5],[279,6,279,8],[289,3,289,5],[289,6,289,8],[294,1,295,1],[298,3,298,5],[298,6,298,8],[334,3,334,5],[334,6,334,8],[367,1,367,2],[369,0,369,9],[370,0,370,4],[370,5,370,9],[371,0,371,3],[371,5,371,8],[372,0,372,3],[372,5,372,8],[373,0,373,3],[373,5,373,8],[374,0,374,3],[374,5,374,8]]}
[]
["Connecticut Housing Finance Authority"]
["Exhibit 4.2 - EXPLODED TRADE PAYMENT BREAKDOWN"]
[]
[]
[null,null,"DEVELOPMENT NAME",{"$f":"IF(ISBLANK(Application!D49), \"\", Application!D49)","v":""},null,null,null,"APPLICANT",{"$f":"IF(ISBLANK(Application!D11),\"\",Application!D11)","v":""},null,null,null,"For Contractor Use"]
[]
[null,null,null,"RESIDENTIAL",null,null,"COMMERCIAL",null,null,"COMBINED TOTAL",null,null,"Requisitioned to Date","Current Requisition"]
["DIVISION",null,"TRADE  ITEM ","QUANTITY","COST ","TOTAL","QUANTITY","COST ","TOTAL"]
["01  GENERAL REQUIREMENTS"]
[null,"General","Project Manager",null,null,{"$f":"D11*E11","v":0},null,null,{"$f":"G11*H11","v":0},{"$f":"I11+F11","v":0},null,null,{"$f":"L11+H11","v":0},0]
[null,"Requirements","Superintendent",null,null,{"$f":"D12*E12","v":0},null,null,0,{"$f":"I12+F12","v":0},null,null,0,0]
[null,null,"Secretary",null,null,0,null,null,0,0,null,null,0,0]
[null,null,"Vehicle Expense",null,null,0,null,null,0,0,null,null,0,0]
[null,null,"Travel Expense",null,null,0,null,null,0,0,null,null,0,0]
{"$rows_left_out":361}
{"sheet":"4.3 Estmd Development Budget","index":9,"n_rows":86,"n_cols":15,"rows_kept":86,"cut":false,"hidden":false,"merged":[[9,7,10,7],[9,8,9,13],[9,14,10,14],[5,2,5,9],[5,13,5,14],[6,3,6,9],[6,13,6,14],[7,13,7,14],[22,1,22,6],[11,1,11,6],[12,1,12,6],[13,1,13,6],[14,1,14,6],[15,1,15,6],[16,1,16,6],[17,1,17,6],[18,1,18,6],[19,1,19,6],[20,1,20,6],[21,1,21,6],[34,1,34,6],[23,1,23,6],[24,1,24,6],[25,1,25,6],[26,1,26,6],[27,1,27,6],[28,1,28,6],[29,1,29,6],[30,1,30,6],[31,1,31,6],[32,1,32,6],[33,1,33,6],[57,1,57,6],[46,1,46,6],[35,1,35,6],[36,1,36,6],[37,1,37,6],[38,1,38,6],[39,1,39,6],[40,1,40,6],[41,1,41,6],[42,1,42,6],[43,1,43,6],[44,1,44,6],[45,1,45,6],[52,1,52,6],[53,1,53,6],[54,1,54,6],[55,1,55,6],[56,1,56,6],[47,1,47,6],[48,1,48,6],[49,1,49,6],[50,1,50,6],[51,1,51,6],[68,1,68,6],[69,1,69,6],[70,1,70,6],[71,1,71,6],[60,1,60,6],[63,1,63,6],[64,1,64,6],[65,1,65,6],[66,1,66,6],[67,1,67,6],[2,0,2,14],[85,1,85,6],[73,1,73,6],[74,1,74,6],[75,1,75,6],[76,1,76,6],[77,1,77,6],[78,1,78,6],[79,1,79,6],[80,1,80,6],[81,1,81,6],[82,1,82,6],[84,1,84,6],[72,1,72,6],[61,1,61,6],[62,1,62,6]]}
[]
[]
["Exhibit 4.3 - ESTIMATED DEVELOPMENT BUDGET"]
[]
[]
["Mortgagor:",null,{"$f":"IF(ISBLANK(Application!D49), \"\", Application!D49)","v":""},null,null,null,null,null,null,null,null,null,"CHFA Loan No.:",{"$f":"IF(ISBLANK('3.16 Fincl Asst Wksht'!C13),\" \", '3.16 Fincl Asst Wksht'!C13)","v":" "}]
["Development Name:",null,null,{"$f":"IF(ISBLANK(Application!D11), \"\", Application!D11)","v":""},null,null,null,null,null,null,null,null,"CHFA Held Sources Amount:",{"$f":"+O86","v":0}]
[null,null,null,null,null,null,null,null,null,null,null,null,"Alternate Sources Amount:",{"$f":"+N86","v":0}]
[]
[null,null,null,null,null,null,null,"TOTAL ESTIMATED BUDGET","ALTERNATE SOURCES",null,null,null,null,null,"CHFA\n(Loan,Escrow,Other)"]
[null,null,null,null,null,null,null,null,"UTILITY","OWNER HELD RESERVES","DECD\n(Home,CDBG,Flex)","OTHER","OTHER","Total"]
[1,"Testing",null,null,null,null,null,{"$f":"+N12+O12","v":0},null,null,null,null,null,{"$f":"+I12+J12+K12+L12+M12","v":0}]
[2,"Environmental",null,null,null,null,null,{"$f":"+N13+O13","v":0},null,null,null,null,null,0]
[3,"Grading & Excavation",null,null,null,null,null,0,null,null,null,null,null,0]
[4,"Site Utilities",null,null,null,null,null,0,null,null,null,null,null,0]
{"$rows_left_out":72}
{"sheet":"4.4 Cash Flow Projection","index":10,"n_rows":102,"n_cols":46,"rows_kept":102,"cut":false,"hidden":false,"merged":[[2,3,2,6],[5,33,5,34],[5,2,5,3],[5,7,5,8],[5,14,5,15],[5,22,5,23]]}
[]
[]
[null,null,null,"Exhibit 4.4 - CASH FLOW PROJECTION"]
[]
[]
[null,"DEVELOPMENT NAME",{"$f":"IF(ISBLANK(Application!D49), \"\", Application!D49)","v":""},null,null,null,"APPLICANT",{"$f":"IF(ISBLANK(Application!D11), \"\", Application!D11)","v":""}]
[]
["INCOME",null,null,null,null,null,1,{"$f":"G8+1","v":2},3,4,5,6,7,8,9,10,11,12,13,14,15,16,17,18,19,20,21,22,23,24,25,26,27,28,29,30,31,32,33,34,35,36,37,38,39,40]
[null,null,null,null,"Growth %",null,{"$f":"'3.7 Development Schedule'!B47","v":0},{"$f":"+G9+1","v":1},2,3,4,5,6,7,8,9,10,11,12,13,14,15,16,17,18,19,20,21,22,23,24,25,26,27,28,29,30,31,32,33,34,35,36,37,38,39]
[]
[null,null,null,"RESIDENTIAL - Qualified / Afford. Gross Rental Income",0.02,null,{"$f":"IF(ISBLANK('4.1 Rental Income Calc Wrksht'!N51),\"\",'4.1 Rental Income Calc Wrksht'!N51)","v":0},{"$f":"G11*(1+$E11)","v":0},0,0,0,0,0,0,0,0,0,0,0,0,0,0,0,0,0,0,0,0,0,0,0,0,0,0,0,0,0,0,0,0,0,0,0,0,0,0]
[null,null,null,"- RESIDENTIAL - Qualified / Afford. Vacancy Loss",0.02,null,{"$f":"IF(ISBLANK('4.1 Rental Income Calc Wrksht'!O51),\"\",'4.1 Rental Income Calc Wrksht'!O51)","v":0},{"$f":"G12*(1+$E12)","v":0},0,0,0,0,0,0,0,0,0,0,0,0,0,0,0,0,0,0,0,0,0,0,0,0,0,0,0,0,0,0,0,0,0,0,0,0,0,0]
[null,null,null,"= RESIDENTIAL - Qualified / Afford. Net Rental Income",0.02,null,{"$f":"G11-G12","v":0},{"$f":"G13*(1+$E13)","v":0},0,0,0,0,0,0,0,0,0,0,0,0,0,0,0,0,0,0,0,0,0,0,0,0,0,0,0,0,0,0,0,0,0,0,0,0,0,0]
[null,null,null,"RESIDENTIAL - Market Rate Gross Rental Income",0.02,null,null,{"$f":"G14*(1+$E14)","v":0},0,0,0,0,0,0,0,0,0,0,0,0,0,0,0,0,0,0,0,0,0,0,0,0,0,0,0,0,0,0,0,0,0,0,0,0,0,0]
[null,null,null,"- RESIDENTIAL - Market Rate Vacancy Loss",0.02,null,null,{"$f":"G15*(1+$E15)","v":0},0,0,0,0,0,0,0,0,0,0,0,0,0,0,0,0,0,0,0,0,0,0,0,0,0,0,0,0,0,0,0,0,0,0,0,0,0,0]
{"$rows_left_out":88}
{"sheet":"4.8 Sources of Funds","index":11,"n_rows":62,"n_cols":12,"rows_kept":62,"cut":false,"hidden":false,"merged":[[2,0,2,12],[5,8,5,10],[12,6,12,12],[13,6,13,12],[10,6,10,12],[11,6,11,12],[3,0,3,12],[5,2,5,5],[44,11,44,12],[34,11,34,12],[35,11,35,12],[37,11,37,12],[39,11,39,12],[36,11,36,12],[23,6,23,12],[43,11,43,12],[14,6,14,12],[22,6,22,12],[15,6,15,12],[38,11,38,12],[40,11,40,12],[41,11,41,12],[42,11,42,12],[32,11,32,12],[24,6,24,12],[33,11,33,12],[28,11,28,12]]}
[]
[]
["Exhibit 4.8- SOURCES OF FUNDS"]
[]
[]
["DEVELOPMENT NAME",null,{"$f":"IF(ISBLANK(Application!D49), \"\", Application!D49)","v":""},null,null,null,null,"APPLICANT",{"$f":"IF(ISBLANK(Application!D11), \"\", Application!D11)","v":""}]
[]
[null,null,"Construction",null,"Permanent","Grant "]
["EQUITY CAPITAL, GRANTS, Etc.",null,"Sources",null,"Sources","[Y] or [N]"]
[]
["DOH / HUD HOME Funds"]
["DOH Affordable Housing Program - FLEX"]
["DOH Housing Trust Fund"]
["DOH / HUD CDBG Small Cities Funds"]
["DOH $300MM Housing Portfolio"]
{"$rows_left_out":47}